Reaction Details
TargetTyrosine-protein kinase JAK2
LigandBDBM50433615
Substrate/Competitorn/a
Meas. Tech.ChEMBL_958068 (CHEMBL2383938)
IC50 4.0±n/a nM
Citation Guan, HLamb, MLPeng, BHuang, SDegrace, NRead, JHussain, SWu, JRivard, CAlimzhanov, MBebernitz, GBell, KYe, MZinda, MIoannidis, S Discovery of novel Jak2-Stat pathway inhibitors with extended residence time on target. Bioorg Med Chem Lett23:3105-10 (2013) 
 
Tyrosine-protein kinase JAK2
Name:Tyrosine-protein kinase JAK2
Type:Protein
Mol. Mass.:130684.68
Organism:Homo sapiens (Human)
Description:O60674
Residue:1132
BDBM50433615
NameBDBM50433615
Synonyms:CHEMBL2381976
TypeSmall organic molecule
Emp. Form.C19H23F2N9
Mol. Mass.415.443
SMILESC[C@H](Nc1nc(Nc2cc(C)n[nH]2)nc(N2CCNCC2)c1F)c1ccc(F)cn1