Reaction Details
TargetSerine/threonine-protein kinase WNK3
LigandBDBM50433629
Substrate/Competitorn/a
Meas. Tech.ChEMBL_959020 (CHEMBL2382833)
IC50 401±n/a nM
Citation Karra, SXiao, YChen, XLiu-Bujalski, LHuck, BSutton, AGoutopoulos, AAskew, BJosephson, KJiang, XShutes, AShankar, VNoonan, TGarcia-Berrios, GDong, RDhanabal, MTian, HWang, ZClark, AGoodstal, S SAR and evaluation of novel 5H-benzo[c][1,8]naphthyridin-6-one analogs as Aurora kinase inhibitors. Bioorg Med Chem Lett23:3081-7 (2013) 
 
Serine/threonine-protein kinase WNK3
Name:Serine/threonine-protein kinase WNK3
Type:PROTEIN
Mol. Mass.:198400.78
Organism:Homo sapiens (Human)
Description:ChEMBL_959020
Residue:1800
BDBM50433629
NameBDBM50433629
Synonyms:CHEMBL2380845
TypeSmall organic molecule
Emp. Form.C25H18N4O2
Mol. Mass.406.436
SMILESO=C(Nc1ccc(Nc2ccnc3[nH]c(=O)c4ccccc4c23)cc1)c1ccccc1