Reaction Details
TargetProto-oncogene tyrosine-protein kinase receptor Ret
LigandBDBM50433630
Substrate/Competitorn/a
Meas. Tech.ChEMBL_959025 (CHEMBL2382838)
IC50 706±n/a nM
Citation Karra, SXiao, YChen, XLiu-Bujalski, LHuck, BSutton, AGoutopoulos, AAskew, BJosephson, KJiang, XShutes, AShankar, VNoonan, TGarcia-Berrios, GDong, RDhanabal, MTian, HWang, ZClark, AGoodstal, S SAR and evaluation of novel 5H-benzo[c][1,8]naphthyridin-6-one analogs as Aurora kinase inhibitors. Bioorg Med Chem Lett23:3081-7 (2013) 
 
Proto-oncogene tyrosine-protein kinase receptor Ret
Name:Proto-oncogene tyrosine-protein kinase receptor Ret
Type:Protein
Mol. Mass.:124318.29
Organism:Homo sapiens (Human)
Description:P07949
Residue:1114
BDBM50433630
NameBDBM50433630
Synonyms:CHEMBL2380834
TypeSmall organic molecule
Emp. Form.C26H16F4N4O2
Mol. Mass.492.4245
SMILESFc1ccc(C(=O)Nc2ccc(Nc3ccnc4[nH]c(=O)c5ccccc5c34)cc2)c(c1)C(F)(F)F