Reaction Details
TargetAurora kinase B
LigandBDBM50433630
Substrate/Competitorn/a
Meas. Tech.ChEMBL_958824 (CHEMBL2384612)
IC50 52±n/a nM
Citation Karra, SXiao, YChen, XLiu-Bujalski, LHuck, BSutton, AGoutopoulos, AAskew, BJosephson, KJiang, XShutes, AShankar, VNoonan, TGarcia-Berrios, GDong, RDhanabal, MTian, HWang, ZClark, AGoodstal, S SAR and evaluation of novel 5H-benzo[c][1,8]naphthyridin-6-one analogs as Aurora kinase inhibitors. Bioorg Med Chem Lett23:3081-7 (2013) 
 
Aurora kinase B
Name:Aurora kinase B
Type:Protein
Mol. Mass.:39327.72
Organism:Homo sapiens (Human)
Description:Q96GD4
Residue:344
BDBM50433630
NameBDBM50433630
Synonyms:CHEMBL2380834
TypeSmall organic molecule
Emp. Form.C26H16F4N4O2
Mol. Mass.492.4245
SMILESFc1ccc(C(=O)Nc2ccc(Nc3ccnc4[nH]c(=O)c5ccccc5c34)cc2)c(c1)C(F)(F)F