Reaction Details
TargetAurora kinase A
LigandBDBM50433637
Substrate/Competitorn/a
Meas. Tech.ChEMBL_959028 (CHEMBL2382841)
IC50 27±n/a nM
Citation Karra, SXiao, YChen, XLiu-Bujalski, LHuck, BSutton, AGoutopoulos, AAskew, BJosephson, KJiang, XShutes, AShankar, VNoonan, TGarcia-Berrios, GDong, RDhanabal, MTian, HWang, ZClark, AGoodstal, S SAR and evaluation of novel 5H-benzo[c][1,8]naphthyridin-6-one analogs as Aurora kinase inhibitors. Bioorg Med Chem Lett23:3081-7 (2013) 
 
Aurora kinase A
Name:Aurora kinase A
Type:Serine/threonine-protein kinase
Mol. Mass.:45830.98
Organism:Homo sapiens (Human)
Description:O14965
Residue:403
BDBM50433637
NameBDBM50433637
Synonyms:CHEMBL2380828
TypeSmall organic molecule
Emp. Form.C26H17F3N4O2
Mol. Mass.474.434
SMILESFC(F)(F)c1ccc(cc1)C(=O)Nc1ccc(Nc2ccnc3[nH]c(=O)c4ccccc4c23)cc1