Reaction Details
TargetAurora kinase A
LigandBDBM50433651
Substrate/Competitorn/a
Meas. Tech.ChEMBL_959028 (CHEMBL2382841)
IC50 3010±n/a nM
Citation Karra, SXiao, YChen, XLiu-Bujalski, LHuck, BSutton, AGoutopoulos, AAskew, BJosephson, KJiang, XShutes, AShankar, VNoonan, TGarcia-Berrios, GDong, RDhanabal, MTian, HWang, ZClark, AGoodstal, S SAR and evaluation of novel 5H-benzo[c][1,8]naphthyridin-6-one analogs as Aurora kinase inhibitors. Bioorg Med Chem Lett23:3081-7 (2013) 
 
Aurora kinase A
Name:Aurora kinase A
Type:Serine/threonine-protein kinase
Mol. Mass.:45830.98
Organism:Homo sapiens (Human)
Description:O14965
Residue:403
BDBM50433651
NameBDBM50433651
Synonyms:CHEMBL2380840
TypeSmall organic molecule
Emp. Form.C12H7ClN2O
Mol. Mass.230.65
SMILESClc1ccnc2[nH]c(=O)c3ccccc3c12