Reaction Details
TargetAcetylcholinesterase
LigandBDBM50163744
Substrate/Competitorn/a
Meas. Tech.ChEMBL_959732 (CHEMBL2383184)
IC50 37740±n/a nM
Citation Arunkhamkaew, SAthipornchai, AApiratikul, NSuksamrarn, AAjavakom, V Novel racemic tetrahydrocurcuminoid dihydropyrimidinone analogues as potent acetylcholinesterase inhibitors. Bioorg Med Chem Lett23:2880-2 (2013) 
 
Acetylcholinesterase
Name:Acetylcholinesterase
Type:Enzyme
Mol. Mass.:71812.79
Organism:Electrophorus electricus (Electric eel)
Description:n/a
Residue:633
BDBM50163744
NameBDBM50163744
Synonyms:(1E,4Z,6E)-5-Hydroxy-1-(4-hydroxy-3-methoxy-phenyl)-7-(4-hydroxy-phenyl)-hepta-1,4,6-trien-3-one 1-(4-hydroxy-3-methoxyphenyl)-7-(4-hydroxyphenyl)-1,6-heptadiene-3,5-dione CHEMBL179512 curcumin II | demethoxycurcumin
TypeSmall organic molecule
Emp. Form.C20H18O5
Mol. Mass.338.3539
SMILESCOc1cc(C=CC(=O)CC(=O)C=Cc2ccc(O)cc2)ccc1O