Reaction Details
TargetMAP kinase-activated protein kinase 2
LigandBDBM50433765
Substrate/Competitorn/a
Meas. Tech.ChEMBL_959963 (CHEMBL2383905)
IC50 910±n/a nM
Citation Meng, ZCiavarri, JPMcRiner, AZhao, YZhao, LReddy, PAZhang, XFischmann, TOWhitehurst, CArshad Siddiqui, M Potency switch between CHK1 and MK2: discovery of imidazo[1,2-a]pyrazine- and imidazo[1,2-c]pyrimidine-based kinase inhibitors. Bioorg Med Chem Lett23:2863-7 (2013) 
 
MAP kinase-activated protein kinase 2
Name:MAP kinase-activated protein kinase 2
Type:Serine/threonine-protein kinase
Mol. Mass.:45579.87
Organism:Homo sapiens (Human)
Description:P49137
Residue:400
BDBM50433765
NameBDBM50433765
Synonyms:CHEMBL2381605
TypeSmall organic molecule
Emp. Form.C18H19FN6O
Mol. Mass.354.3815
SMILESNC(=O)c1cnc(N[C@H]2CCCNC2)c2nc(cn12)-c1ccc(F)cc1