Reaction Details
TargetCoagulation factor XI
LigandBDBM50433784
Substrate/Competitorn/a
Meas. Tech.ChEMBL_958156 (CHEMBL2384248)
Ki>55000±n/a nM
Citation Wang, TCQiao, JXClark, CGJua, JPrice, LAWu, QChang, MZheng, JHuang, CSEverlof, GSchumacher, WAWong, PCSeiffert, DAStewart, ABBostwick, JSCrain, EJWatson, CARehfuss, RWexler, RRLam, PY Discovery of diarylurea P2Y(1) antagonists with improved aqueous solubility. Bioorg Med Chem Lett23:3239-43 (2013) 
 
Coagulation factor XI
Name:Coagulation factor XI
Type:Enzyme
Mol. Mass.:70130.58
Organism:Homo sapiens (Human)
Description:P03951
Residue:625
BDBM50433784
NameBDBM50433784
Synonyms:CHEMBL2381898
TypeSmall organic molecule
Emp. Form.C31H33FN4O2
Mol. Mass.512.6177
SMILESCN(C)Cc1ccccc1-c1ccc(NC(=O)Nc2cccnc2Oc2ccccc2C(C)(C)C)c(F)c1