Reaction Details
TargetP2Y purinoceptor 1
LigandBDBM50433789
Substrate/Competitorn/a
Meas. Tech.ChEMBL_958358 (CHEMBL2382617)
Ki 11±n/a nM
Citation Wang, TCQiao, JXClark, CGJua, JPrice, LAWu, QChang, MZheng, JHuang, CSEverlof, GSchumacher, WAWong, PCSeiffert, DAStewart, ABBostwick, JSCrain, EJWatson, CARehfuss, RWexler, RRLam, PY Discovery of diarylurea P2Y(1) antagonists with improved aqueous solubility. Bioorg Med Chem Lett23:3239-43 (2013) 
 
P2Y purinoceptor 1
Name:P2Y purinoceptor 1
Type:Enzyme
Mol. Mass.:42090.25
Organism:Homo sapiens (Human)
Description:P47900
Residue:373
BDBM50433789
NameBDBM50433789
Synonyms:CHEMBL2381904
TypeSmall organic molecule
Emp. Form.C35H39FN4O3
Mol. Mass.582.7076
SMILESCC(C)(C)c1ccccc1Oc1ncccc1NC(=O)Nc1ccc(OCC2CCN(Cc3ccccc3)CC2)cc1F