Reaction Details
TargetP2Y purinoceptor 1
LigandBDBM50433790
Substrate/Competitorn/a
Meas. Tech.ChEMBL_958358 (CHEMBL2382617)
Ki 52±n/a nM
Citation Wang, TCQiao, JXClark, CGJua, JPrice, LAWu, QChang, MZheng, JHuang, CSEverlof, GSchumacher, WAWong, PCSeiffert, DAStewart, ABBostwick, JSCrain, EJWatson, CARehfuss, RWexler, RRLam, PY Discovery of diarylurea P2Y(1) antagonists with improved aqueous solubility. Bioorg Med Chem Lett23:3239-43 (2013) 
 
P2Y purinoceptor 1
Name:P2Y purinoceptor 1
Type:Enzyme
Mol. Mass.:42090.25
Organism:Homo sapiens (Human)
Description:P47900
Residue:373
BDBM50433790
NameBDBM50433790
Synonyms:CHEMBL2381903
TypeSmall organic molecule
Emp. Form.C29H37FN4O3
Mol. Mass.508.6275
SMILESCN(C)CC(C)(C)COc1ccc(NC(=O)Nc2cccnc2Oc2ccccc2C(C)(C)C)c(F)c1