Reaction Details
TargetP2Y purinoceptor 1
LigandBDBM50433791
Substrate/Competitorn/a
Meas. Tech.ChEMBL_958358 (CHEMBL2382617)
Ki 163±n/a nM
Citation Wang, TCQiao, JXClark, CGJua, JPrice, LAWu, QChang, MZheng, JHuang, CSEverlof, GSchumacher, WAWong, PCSeiffert, DAStewart, ABBostwick, JSCrain, EJWatson, CARehfuss, RWexler, RRLam, PY Discovery of diarylurea P2Y(1) antagonists with improved aqueous solubility. Bioorg Med Chem Lett23:3239-43 (2013) 
 
P2Y purinoceptor 1
Name:P2Y purinoceptor 1
Type:Enzyme
Mol. Mass.:42090.25
Organism:Homo sapiens (Human)
Description:P47900
Residue:373
BDBM50433791
NameBDBM50433791
Synonyms:CHEMBL2381902
TypeSmall organic molecule
Emp. Form.C28H38N4O3Si
Mol. Mass.506.7118
SMILESCN(C)CC(C)(C)COc1ccc(NC(=O)Nc2cccnc2Oc2ccccc2[Si](C)(C)C)cc1