Reaction Details
TargetP2Y purinoceptor 1
LigandBDBM50433793
Substrate/Competitorn/a
Meas. Tech.ChEMBL_958358 (CHEMBL2382617)
Ki 37±n/a nM
Citation Wang, TCQiao, JXClark, CGJua, JPrice, LAWu, QChang, MZheng, JHuang, CSEverlof, GSchumacher, WAWong, PCSeiffert, DAStewart, ABBostwick, JSCrain, EJWatson, CARehfuss, RWexler, RRLam, PY Discovery of diarylurea P2Y(1) antagonists with improved aqueous solubility. Bioorg Med Chem Lett23:3239-43 (2013) 
 
P2Y purinoceptor 1
Name:P2Y purinoceptor 1
Type:Enzyme
Mol. Mass.:42090.25
Organism:Homo sapiens (Human)
Description:P47900
Residue:373
BDBM50433793
NameBDBM50433793
Synonyms:CHEMBL2381900
TypeSmall organic molecule
Emp. Form.C31H33FN4O2
Mol. Mass.512.6177
SMILESCN(C)Cc1ccc(cc1)-c1ccc(NC(=O)Nc2cccnc2Oc2ccccc2C(C)(C)C)c(F)c1