Reaction Details
TargetP2Y purinoceptor 1
LigandBDBM50433796
Substrate/Competitorn/a
Meas. Tech.ChEMBL_958358 (CHEMBL2382617)
Ki 25±n/a nM
Citation Wang, TCQiao, JXClark, CGJua, JPrice, LAWu, QChang, MZheng, JHuang, CSEverlof, GSchumacher, WAWong, PCSeiffert, DAStewart, ABBostwick, JSCrain, EJWatson, CARehfuss, RWexler, RRLam, PY Discovery of diarylurea P2Y(1) antagonists with improved aqueous solubility. Bioorg Med Chem Lett23:3239-43 (2013) 
 
P2Y purinoceptor 1
Name:P2Y purinoceptor 1
Type:Enzyme
Mol. Mass.:42090.25
Organism:Homo sapiens (Human)
Description:P47900
Residue:373
BDBM50433796
NameBDBM50433796
Synonyms:CHEMBL2381896
TypeSmall organic molecule
Emp. Form.C26H29FN4O3
Mol. Mass.464.5319
SMILESCC(C)(C)c1ccccc1Oc1ncccc1NC(=O)Nc1ccc(cc1F)N1CCOCC1