Reaction Details
TargetTyrosine-protein kinase CSK
LigandBDBM50433806
Substrate/Competitorn/a
Meas. Tech.ChEMBL_958388 (CHEMBL2382770)
IC50 800±n/a nM
Citation Nasrolahi Shirazi, ATiwari, RKBrown, AMandal, DSun, GParang, K Cyclic peptides containing tryptophan and arginine as Src kinase inhibitors. Bioorg Med Chem Lett23:3230-4 (2013) 
 
Tyrosine-protein kinase CSK
Name:Tyrosine-protein kinase CSK
Type:Tyrosine-protein kinase
Mol. Mass.:50707.30
Organism:Homo sapiens (Human)
Description:P41240
Residue:450
BDBM50433806
NameBDBM50433806
Synonyms:CHEMBL2382016
TypeSmall organic molecule
Emp. Form.C85H110N30O10
Mol. Mass.1711.9779
SMILESNC(N)=NCCC[C@@H]1NC(=O)[C@H](Cc2c[nH]c3ccccc23)NC(=O)[C@H](CCCN=C(N)N)NC(=O)[C@H](Cc2c[nH]c3ccccc23)NC(=O)[C@H](CCCN=C(N)N)NC(=O)[C@H](Cc2c[nH]c3ccccc23)NC(=O)[C@H](CCCN=C(N)N)NC(=O)[C@H](Cc2c[nH]c3ccccc23)NC(=O)[C@H](CCCN=C(N)N)NC(=O)[C@H](Cc2c[nH]c3ccccc23)NC1=O