Reaction Details
TargetDihydrofolate reductase
LigandBDBM18224
Substrate/Competitorn/a
Meas. Tech.ChEMBL_959374 (CHEMBL2384165)
IC50 3.0±n/a nM
Citation Gangjee, ANamjoshi, OARaghavan, SQueener, SFKisliuk, RLCody, V Design, synthesis, and molecular modeling of novel pyrido[2,3-d]pyrimidine analogues as antifolates; application of Buchwald-Hartwig aminations of heterocycles. J Med Chem56:4422-41 (2013) 
 
Dihydrofolate reductase
Name:Dihydrofolate reductase
Type:Enzyme
Mol. Mass.:21453.99
Organism:Homo sapiens (Human)
Description:Recombinant human DHFR.
Residue:187
BDBM18224
NameBDBM18224
Synonyms:6-[(2,5-dimethoxyphenyl)methyl]-5-methylpyrido[2,3-d]pyrimidine-2,4-diamine PTX [2-amino-6-(2,5-dimethoxybenzyl)-5-methyl-pyrido[2,3-d]pyrimidin-4-yl]amine;2-hydroxyethanesulfonic acid
TypeSmall organic molecule
Emp. Form.C17H19N5O2
Mol. Mass.325.3651
SMILESCOc1ccc(OC)c(Cc2cnc3nc(N)nc(N)c3c2C)c1