Reaction Details
TargetGlucose-dependent insulinotropic receptor
LigandBDBM50433858
Substrate/Competitorn/a
Meas. Tech.ChEMBL_959597 (CHEMBL2382542)
IC50 2716±n/a nM
Citation Scott, JSBrocklehurst, KJBrown, HSClarke, DSCoe, HGroombridge, SDLaber, DMacFaul, PAMcKerrecher, DSchofield, P Conformational restriction in a series of GPR119 agonists: differences in pharmacology between mouse and human. Bioorg Med Chem Lett23:3175-9 (2013) 
 
Glucose-dependent insulinotropic receptor
Name:Glucose-dependent insulinotropic receptor
Type:PROTEIN
Mol. Mass.:37009.07
Organism:Mus musculus
Description:ChEMBL_1506420
Residue:335
BDBM50433858
NameBDBM50433858
Synonyms:CHEMBL2382416
TypeSmall organic molecule
Emp. Form.C20H22N8O2
Mol. Mass.406.4411
SMILESCC(C)c1nc(no1)N1CCN(CC1)c1ncc(OCc2ccncc2C#N)cn1