Reaction Details
TargetGlucose-dependent insulinotropic receptor
LigandBDBM50433859
Substrate/Competitorn/a
Meas. Tech.ChEMBL_959597 (CHEMBL2382542)
IC50 104±n/a nM
Citation Scott, JSBrocklehurst, KJBrown, HSClarke, DSCoe, HGroombridge, SDLaber, DMacFaul, PAMcKerrecher, DSchofield, P Conformational restriction in a series of GPR119 agonists: differences in pharmacology between mouse and human. Bioorg Med Chem Lett23:3175-9 (2013) 
 
Glucose-dependent insulinotropic receptor
Name:Glucose-dependent insulinotropic receptor
Type:PROTEIN
Mol. Mass.:37009.07
Organism:Mus musculus
Description:ChEMBL_1506420
Residue:335
BDBM50433859
NameBDBM50433859
Synonyms:CHEMBL2382415
TypeSmall organic molecule
Emp. Form.C20H19F3N6O3
Mol. Mass.448.3985
SMILESFC(F)(F)COC(=O)N1C2CCC1CN(C2)c1ncc(OCc2ccncc2C#N)cn1