Reaction Details
TargetGlucose-dependent insulinotropic receptor
LigandBDBM50433854
Substrate/Competitorn/a
Meas. Tech.ChEMBL_959597 (CHEMBL2382542)
IC50 694±n/a nM
Citation Scott, JSBrocklehurst, KJBrown, HSClarke, DSCoe, HGroombridge, SDLaber, DMacFaul, PAMcKerrecher, DSchofield, P Conformational restriction in a series of GPR119 agonists: differences in pharmacology between mouse and human. Bioorg Med Chem Lett23:3175-9 (2013) 
 
Glucose-dependent insulinotropic receptor
Name:Glucose-dependent insulinotropic receptor
Type:PROTEIN
Mol. Mass.:37009.07
Organism:Mus musculus
Description:ChEMBL_1506420
Residue:335
BDBM50433854
NameBDBM50433854
Synonyms:CHEMBL2382412
TypeSmall organic molecule
Emp. Form.C21H20F4N6O3
Mol. Mass.480.4155
SMILESC[C@@H]1CN(CCN1c1ncc(OCc2ccncc2C#N)cn1)C(=O)OC1CC(F)(F)C1(F)F