Reaction Details
TargetGlucose-dependent insulinotropic receptor
LigandBDBM50433858
Substrate/Competitorn/a
Meas. Tech.ChEMBL_959598 (CHEMBL2382543)
IC50 12±n/a nM
Citation Scott, JSBrocklehurst, KJBrown, HSClarke, DSCoe, HGroombridge, SDLaber, DMacFaul, PAMcKerrecher, DSchofield, P Conformational restriction in a series of GPR119 agonists: differences in pharmacology between mouse and human. Bioorg Med Chem Lett23:3175-9 (2013) 
 
Glucose-dependent insulinotropic receptor
Name:Glucose-dependent insulinotropic receptor
Type:Protein
Mol. Mass.:36901.49
Organism:Homo sapiens (Human)
Description:Q8TDV5
Residue:335
BDBM50433858
NameBDBM50433858
Synonyms:CHEMBL2382416
TypeSmall organic molecule
Emp. Form.C20H22N8O2
Mol. Mass.406.4411
SMILESCC(C)c1nc(no1)N1CCN(CC1)c1ncc(OCc2ccncc2C#N)cn1