Reaction Details
TargetGlucose-dependent insulinotropic receptor
LigandBDBM50420863
Substrate/Competitorn/a
Meas. Tech.ChEMBL_959598 (CHEMBL2382543)
IC50 17±n/a nM
Citation Scott, JSBrocklehurst, KJBrown, HSClarke, DSCoe, HGroombridge, SDLaber, DMacFaul, PAMcKerrecher, DSchofield, P Conformational restriction in a series of GPR119 agonists: differences in pharmacology between mouse and human. Bioorg Med Chem Lett23:3175-9 (2013) 
 
Glucose-dependent insulinotropic receptor
Name:Glucose-dependent insulinotropic receptor
Type:Protein
Mol. Mass.:36901.49
Organism:Homo sapiens (Human)
Description:Q8TDV5
Residue:335
BDBM50420863
NameBDBM50420863
Synonyms:CHEMBL2086660
TypeSmall organic molecule
Emp. Form.C22H30N4O5S
Mol. Mass.462.562
SMILESC[C@@H]1CN(CCN1c1ncc(OCc2ccc(cc2)S(C)(=O)=O)cn1)C(=O)OC(C)(C)C