Reaction Details
TargetMatrix metalloproteinase-14
LigandBDBM50433869
Substrate/Competitorn/a
Meas. Tech.ChEMBL_959632 (CHEMBL2382702)
Ki>25000±n/a nM
Citation Jin, YRoycik, MDBosco, DBCao, QConstantino, MHSchwartz, MASang, QX Matrix metalloproteinase inhibitors based on the 3-mercaptopyrrolidine core. J Med Chem56:4357-73 (2013) 
 
Matrix metalloproteinase-14
Name:Matrix metalloproteinase-14
Type:Protein
Mol. Mass.:65900.19
Organism:Homo sapiens (Human)
Description:P50281
Residue:582
BDBM50433869
NameBDBM50433869
Synonyms:CHEMBL2380398
TypeSmall organic molecule
Emp. Form.C18H19NO2S
Mol. Mass.313.414
SMILESS[C@H]1CCC[C@@H]1NC(=O)c1ccc(Oc2ccccc2)cc1