Reaction Details
TargetMatrix metalloproteinase-14
LigandBDBM50433876
Substrate/Competitorn/a
Meas. Tech.ChEMBL_959632 (CHEMBL2382702)
Ki 25000±n/a nM
Citation Jin, YRoycik, MDBosco, DBCao, QConstantino, MHSchwartz, MASang, QX Matrix metalloproteinase inhibitors based on the 3-mercaptopyrrolidine core. J Med Chem56:4357-73 (2013) 
 
Matrix metalloproteinase-14
Name:Matrix metalloproteinase-14
Type:Protein
Mol. Mass.:65900.19
Organism:Homo sapiens (Human)
Description:P50281
Residue:582
BDBM50433876
NameBDBM50433876
Synonyms:CHEMBL2380391
TypeSmall organic molecule
Emp. Form.C17H19NO3S2
Mol. Mass.349.468
SMILESS[C@H]1CCC[C@H]1NS(=O)(=O)c1ccc(Oc2ccccc2)cc1