Reaction Details
TargetMatrilysin
LigandBDBM50433869
Substrate/Competitorn/a
Meas. Tech.ChEMBL_959635 (CHEMBL2382705)
Ki 5700±n/a nM
Citation Jin, YRoycik, MDBosco, DBCao, QConstantino, MHSchwartz, MASang, QX Matrix metalloproteinase inhibitors based on the 3-mercaptopyrrolidine core. J Med Chem56:4357-73 (2013) 
 
Matrilysin
Name:Matrilysin
Type:Enzyme
Mol. Mass.:29681.54
Organism:Homo sapiens (Human)
Description:P09237
Residue:267
BDBM50433869
NameBDBM50433869
Synonyms:CHEMBL2380398
TypeSmall organic molecule
Emp. Form.C18H19NO2S
Mol. Mass.313.414
SMILESS[C@H]1CCC[C@@H]1NC(=O)c1ccc(Oc2ccccc2)cc1