Reaction Details
TargetDual specificity protein kinase TTK
LigandBDBM50433907
Substrate/Competitorn/a
Meas. Tech.ChEMBL_959816 (CHEMBL2383388)
IC50 3.1±n/a nM
Citation Kusakabe, KIde, NDaigo, YTachibana, YItoh, TYamamoto, THashizume, HHato, YHigashino, KOkano, YSato, YInoue, MIguchi, MKanazawa, TIshioka, YDohi, KKido, YSakamoto, SYasuo, KMaeda, MHigaki, MUeda, KYoshizawa, HBaba, YShiota, TMurai, HNakamura, Y Indazole-based potent and cell-active Mps1 kinase inhibitors: rational design from pan-kinase inhibitor anthrapyrazolone (SP600125). J Med Chem56:4343-56 (2013) 
 
Dual specificity protein kinase TTK
Name:Dual specificity protein kinase TTK
Type:Protein
Mol. Mass.:97086.79
Organism:Homo sapiens (Human)
Description:P33981
Residue:857
BDBM50433907
NameBDBM50433907
Synonyms:CHEMBL2380582
TypeSmall organic molecule
Emp. Form.C19H19N5O3S
Mol. Mass.397.451
SMILESCCOc1cc2c(n[nH]c2cc1-c1cnn(C)c1)-c1cccc(c1)S(N)(=O)=O