Reaction Details
TargetAtypical chemokine receptor 3
LigandBDBM50434050
Substrate/Competitorn/a
Meas. Tech.ChEMBL_958224 (CHEMBL2384567)
IC50 7000±n/a nM
Citation Yoshikawa, YOishi, SKubo, TTanahara, NFujii, NFuruya, T Optimized method of G-protein-coupled receptor homology modeling: its application to the discovery of novel CXCR7 ligands. J Med Chem56:4236-51 (2013) 
 
Atypical chemokine receptor 3
Name:Atypical chemokine receptor 3
Type:Enzyme
Mol. Mass.:41498.84
Organism:Homo sapiens (Human)
Description:P25106
Residue:362
BDBM50434050
NameBDBM50434050
Synonyms:CHEMBL2381220
TypeSmall organic molecule
Emp. Form.C21H25N3O2S
Mol. Mass.383.507
SMILESCc1ccc2[nH]c(=O)c3cc(sc3c2c1)C(=O)NCCN1CCCCCC1