Reaction Details
TargetAtypical chemokine receptor 3
LigandBDBM50434053
Substrate/Competitorn/a
Meas. Tech.ChEMBL_958224 (CHEMBL2384567)
IC50 5840±n/a nM
Citation Yoshikawa, YOishi, SKubo, TTanahara, NFujii, NFuruya, T Optimized method of G-protein-coupled receptor homology modeling: its application to the discovery of novel CXCR7 ligands. J Med Chem56:4236-51 (2013) 
 
Atypical chemokine receptor 3
Name:Atypical chemokine receptor 3
Type:Enzyme
Mol. Mass.:41498.84
Organism:Homo sapiens (Human)
Description:P25106
Residue:362
BDBM50434053
NameBDBM50434053
Synonyms:CHEMBL2381217
TypeSmall organic molecule
Emp. Form.C26H30N4O
Mol. Mass.414.5426
SMILESCN(Cc1ccccc1NC(=O)\C=C\c1cnn(c1)-c1ccccc1)C1CCCCC1