Reaction Details
TargetAtypical chemokine receptor 3
LigandBDBM50434056
Substrate/Competitorn/a
Meas. Tech.ChEMBL_958224 (CHEMBL2384567)
IC50 4350±n/a nM
Citation Yoshikawa, YOishi, SKubo, TTanahara, NFujii, NFuruya, T Optimized method of G-protein-coupled receptor homology modeling: its application to the discovery of novel CXCR7 ligands. J Med Chem56:4236-51 (2013) 
 
Atypical chemokine receptor 3
Name:Atypical chemokine receptor 3
Type:Enzyme
Mol. Mass.:41498.84
Organism:Homo sapiens (Human)
Description:P25106
Residue:362
BDBM50434056
NameBDBM50434056
Synonyms:CHEMBL2381338
TypeSmall organic molecule
Emp. Form.C22H23N3OS
Mol. Mass.377.503
SMILESCc1ccc(cc1)C(=O)Nc1ncc(CN2CCC(C2)c2ccccc2)s1