Reaction Details
TargetAtypical chemokine receptor 3
LigandBDBM50434060
Substrate/Competitorn/a
Meas. Tech.ChEMBL_958224 (CHEMBL2384567)
IC50 2780±n/a nM
Citation Yoshikawa, YOishi, SKubo, TTanahara, NFujii, NFuruya, T Optimized method of G-protein-coupled receptor homology modeling: its application to the discovery of novel CXCR7 ligands. J Med Chem56:4236-51 (2013) 
 
Atypical chemokine receptor 3
Name:Atypical chemokine receptor 3
Type:Enzyme
Mol. Mass.:41498.84
Organism:Homo sapiens (Human)
Description:P25106
Residue:362
BDBM50434060
NameBDBM50434060
Synonyms:CHEMBL1430708
TypeSmall organic molecule
Emp. Form.C27H32N4O2S
Mol. Mass.476.634
SMILESCCC(C(=O)NCCCN(CC)Cc1ccccc1)n1nc(C)c2sc3ccccc3c2c1=O