Reaction Details
TargetCaspase-3
LigandBDBM10320
Substrate/Competitorn/a
Meas. Tech.ChEMBL_958429 (CHEMBL2382937)
Ki 15±n/a nM
Citation Limpachayaporn, PWagner, SKopka, KHermann, SSchäfers, MHaufe, G Synthesis, 18F-radiolabeling, and in vivo biodistribution studies of N-fluorohydroxybutyl isatin sulfonamides using positron emission tomography. J Med Chem56:4509-20 (2013) 
 
Caspase-3
Name:Caspase-3
Type:Hydrolase; heterotetramer of two heterodimers
Mol. Mass.:31607.55
Organism:Homo sapiens (Human)
Description:n/a
Residue:277
BDBM10320
NameBDBM10320
Synonyms:(S)-1-Methyl-5-{1-[2-(phenoxymethyl)pyrrolidinyl]sulfonyl}isatin CHEMBL293034 Isatin Sulfonamide 31 | Pyrrolidine Isatin Analogue 11a
TypeSmall organic molecule
Emp. Form.C20H20N2O5S
Mol. Mass.400.448
SMILESCN1C(=O)C(=O)c2cc(ccc12)S(=O)(=O)N1CCC[C@H]1COc1ccccc1