Reaction Details
TargetMetabotropic glutamate receptor 2
LigandBDBM50434136
Substrate/Competitorn/a
Meas. Tech.ChEMBL_959167 (CHEMBL2383450)
EC50 0.160000±n/a nM
Citation Monn, JAValli, MJMassey, SMHao, JReinhard, MRBures, MGHeinz, BAWang, XCarter, JHGetman, BGStephenson, GAHerin, MCatlow, JTSwanson, SJohnson, BGMcKinzie, DLHenry, SS Synthesis and pharmacological characterization of 4-substituted-2-aminobicyclo[3.1.0]hexane-2,6-dicarboxylates: identification of new potent and selective metabotropic glutamate 2/3 receptor agonists. J Med Chem56:4442-55 (2013) 
 
Metabotropic glutamate receptor 2
Name:Metabotropic glutamate receptor 2
Type:Enzyme
Mol. Mass.:95584.88
Organism:Homo sapiens (Human)
Description:Q14416
Residue:872
BDBM50434136
NameBDBM50434136
Synonyms:CHEMBL2381640
TypeSmall organic molecule
Emp. Form.C8H9NO5
Mol. Mass.199.1608
SMILESN[C@]1(CC(=O)[C@H]2[C@@H]([C@@H]12)C(O)=O)C(O)=O