Reaction Details
TargetProstate-specific antigen
LigandBDBM50434142
Substrate/Competitorn/a
Meas. Tech.ChEMBL_959190 (CHEMBL2383473)
pH7.8±n/a
Ki 72±n/a nM
Commentsextracted
Citation Kostova, MBRosen, DMChen, YMease, RCDenmeade, SR Structural optimization, biological evaluation, and application of peptidomimetic prostate specific antigen inhibitors. J Med Chem56:4224-35 (2013) 
 
Prostate-specific antigen
Name:Prostate-specific antigen
Type:PROTEIN
Mol. Mass.:28747.53
Organism:Homo sapiens (Human)
Description:ChEMBL_959198
Residue:261
BDBM50434142
NameBDBM50434142
Synonyms:CHEMBL2381669
TypeSmall organic molecule
Emp. Form.C33H55BBrN7O9
Mol. Mass.784.546
SMILESCCCC[C@H](NC(=O)[C@H](CCC(N)=O)NC(=O)[C@H](CO)NC(=O)[C@H](Cc1ccccc1)NC(=O)CCCCCN)C(=O)N[C@H](CCCBr)B(O)O