Reaction Details
TargetProstate-specific antigen
LigandBDBM50434152
Substrate/Competitorn/a
Meas. Tech.ChEMBL_959198 (CHEMBL2383481)
Ki 43±n/a nM
Citation Kostova, MBRosen, DMChen, YMease, RCDenmeade, SR Structural optimization, biological evaluation, and application of peptidomimetic prostate specific antigen inhibitors. J Med Chem56:4224-35 (2013) 
 
Prostate-specific antigen
Name:Prostate-specific antigen
Type:PROTEIN
Mol. Mass.:28747.53
Organism:Homo sapiens (Human)
Description:ChEMBL_959198
Residue:261
BDBM50434152
NameBDBM50434152
Synonyms:CHEMBL2381665
TypeSmall organic molecule
Emp. Form.C28H54BN7O10
Mol. Mass.659.58
SMILESCCCC[C@H](NC(=O)[C@H](CCC(N)=O)NC(=O)[C@H](CO)NC(=O)[C@H](CO)NC(=O)CCCCCN)C(=O)N[C@H](CC(C)C)B(O)O