Reaction Details
TargetProstate-specific antigen
LigandBDBM50434153
Substrate/Competitorn/a
Meas. Tech.ChEMBL_959198 (CHEMBL2383481)
Ki 24±n/a nM
Citation Kostova, MBRosen, DMChen, YMease, RCDenmeade, SR Structural optimization, biological evaluation, and application of peptidomimetic prostate specific antigen inhibitors. J Med Chem56:4224-35 (2013) 
 
Prostate-specific antigen
Name:Prostate-specific antigen
Type:PROTEIN
Mol. Mass.:28747.53
Organism:Homo sapiens (Human)
Description:ChEMBL_959198
Residue:261
BDBM50434153
NameBDBM50434153
Synonyms:CHEMBL2381668
TypeSmall organic molecule
Emp. Form.C30H50BBrN6O10
Mol. Mass.745.467
SMILESCCCC[C@H](NC(=O)[C@H](CCCCN)NC(=O)[C@H](CO)NC(=O)[C@H](CO)NC(=O)OCc1ccccc1)C(=O)N[C@H](CCCBr)B(O)O