Reaction Details
TargetProlyl endopeptidase FAP
LigandBDBM50434188
Substrate/Competitorn/a
Meas. Tech.ChEMBL_960574 (CHEMBL2389863)
Ki 3.0±n/a nM
Citation Jansen, KHeirbaut, LCheng, JDJoossens, JRyabtsova, OCos, PMaes, LLambeir, AMDe Meester, IAugustyns, KVan der Veken, P Selective Inhibitors of Fibroblast Activation Protein (FAP) with a (4-Quinolinoyl)-glycyl-2-cyanopyrrolidine Scaffold. ACS Med Chem Lett4:491-6 (2013) 
 
Prolyl endopeptidase FAP
Name:Prolyl endopeptidase FAP
Type:Enzyme
Mol. Mass.:87949.14
Organism:Mus musculus (Mouse)
Description:P97321
Residue:761
BDBM50434188
NameBDBM50434188
Synonyms:CHEMBL2385281 | US9346814, Cmpd No 2 Example 3
TypeSmall organic molecule
Emp. Form.C17H16N4O2
Mol. Mass.308.3345
SMILESO=C(CNC(=O)c1ccnc2ccccc12)N1CCC[C@H]1C#N