Reaction Details
TargetDihydroorotate dehydrogenase (quinone), mitochondrial
LigandBDBM50434229
Substrate/Competitorn/a
Meas. Tech.ChEMBL_960944 (CHEMBL2388704)
IC50 16±n/a nM
Citation Das, PDeng, XZhang, LRoth, MGFontoura, BMPhillips, MADe Brabander, JK SAR Based Optimization of a 4-Quinoline Carboxylic Acid Analog with Potent Anti-Viral Activity. ACS Med Chem Lett4:517-521 (2013) 
 
Dihydroorotate dehydrogenase (quinone), mitochondrial
Name:Dihydroorotate dehydrogenase (quinone), mitochondrial
Type:Enzyme
Mol. Mass.:42881.33
Organism:Homo sapiens (Human)
Description:Q02127
Residue:395
BDBM50434229
NameBDBM50434229
Synonyms:CHEMBL2385511
TypeSmall organic molecule
Emp. Form.C24H18FNO3
Mol. Mass.387.403
SMILESCc1cc(cc(C)c1Oc1ccccc1)-c1cc(C(O)=O)c2cc(F)ccc2n1