Reaction Details
TargetIsocitrate dehydrogenase [NADP] cytoplasmic
LigandBDBM50434276
Substrate/Competitorn/a
Meas. Tech.ChEMBL_961313 (CHEMBL2390489)
Ki>50000±n/a nM
Citation Zheng, BYao, YLiu, ZDeng, LAnglin, JLJiang, HPrasad, BVSong, Y Crystallographic Investigation and Selective Inhibition of Mutant Isocitrate Dehydrogenase. ACS Med Chem Lett4:542-546 (2013) 
 
Isocitrate dehydrogenase [NADP] cytoplasmic
Name:Isocitrate dehydrogenase [NADP] cytoplasmic
Type:Protein
Mol. Mass.:46661.29
Organism:Homo sapiens (Human)
Description:O75874
Residue:414
BDBM50434276
NameBDBM50434276
Synonyms:CHEMBL2386125
TypeSmall organic molecule
Emp. Form.C12H13NO2
Mol. Mass.203.2371
SMILESOC1C=CC(Cc2ccccc2)=CN1O