Reaction Details
TargetCytochrome P450 1A2
LigandBDBM50434279
Substrate/Competitorn/a
Meas. Tech.ChEMBL_961653 (CHEMBL2389154)
IC50>10000±n/a nM
Citation Dreyfus, NMyers, JKBadescu, VOde Frutos, Ode la Puente, MLDing, CFilla, SAFynboe, KGernert, DLHeinz, BAHemrick-Luecke, SKJohnson, KWJohnson, MPLópez, PLove, PLMartin, LJMasquelin, TMcCoy, MJMendiola, JMorrow, DMuhlhauser, MPascual, GPerun, TJPfeifer, LAPhebus, LARichards, SJRincón, JASeest, EPShah, JShaojuan, JSimmons, RMStephenson, GATromiczak, EGThompson, LKWalter, MWWeber, WWZarrinmayeh, HThomas, CEJoshi, EIyengar, SJohansson, AM Discovery of a potent, dual serotonin and norepinephrine reuptake inhibitor. ACS Med Chem Lett4:560-4 (2013) 
 
Cytochrome P450 1A2
Name:Cytochrome P450 1A2
Type:Enzyme
Mol. Mass.:58423.38
Organism:Homo sapiens (Human)
Description:P05177
Residue:516
BDBM50434279
NameBDBM50434279
Synonyms:CHEMBL2386162
TypeSmall organic molecule
Emp. Form.C16H26N2O2
Mol. Mass.278.3898
SMILESCOc1ccc(O[C@@H](CC(C)C)[C@H]2CCNC2)c(C)n1