Reaction Details
TargetFatty-acid amide hydrolase 1 [30-579]
LigandBDBM50434328
Substrate/Competitorn/a
Meas. Tech.ChEMBL_960984 (CHEMBL2388900)
IC50 4.2±n/a nM
Citation Liu, PHamill, TGChioda, MChobanian, HFung, SGuo, YChang, LBakshi, RHong, QDellureficio, JLin, LSAbbadie, CAlexander, JJin, HMandala, SShiao, LLLi, WSanabria, SWilliams, DZeng, ZHajdu, RJochnowitz, NRosenbach, MKaranam, BMadeira, MSalituro, GPowell, JXu, LTerebetski, JLLeone, JFMiller, PCook, JHolahan, MJoshi, AO'Malley, SPurcell, MPosavec, DChen, TBRiffel, KWilliams, MHargreaves, RSullivan, KANargund, RPDeVita, RJ Discovery of MK-3168: A PET Tracer for Imaging Brain Fatty Acid Amide Hydrolase. ACS Med Chem Lett4:509-13 (2013) 
 
Fatty-acid amide hydrolase 1 [30-579]
Name:Fatty-acid amide hydrolase 1 [30-579]
Type:Single-pass membrane protein; homodimer
Mol. Mass.:60474.00
Organism:Rattus norvegicus (rat)
Description:P97612 (aa 30-579)
Residue:550
BDBM50434328
NameBDBM50434328
Synonyms:CHEMBL2386555
TypeSmall organic molecule
Emp. Form.C22H20ClN3OS
Mol. Mass.409.932
SMILESNC(=O)[C@H]1C[C@@H]1c1ccc(cc1)-c1nn(cc1Sc1ccc(Cl)cc1)C1CC1