Reaction Details
TargetFatty-acid amide hydrolase 1
LigandBDBM50434318
Substrate/Competitorn/a
Meas. Tech.ChEMBL_960986 (CHEMBL2388902)
IC50 0.300000±n/a nM
Citation Liu, PHamill, TGChioda, MChobanian, HFung, SGuo, YChang, LBakshi, RHong, QDellureficio, JLin, LSAbbadie, CAlexander, JJin, HMandala, SShiao, LLLi, WSanabria, SWilliams, DZeng, ZHajdu, RJochnowitz, NRosenbach, MKaranam, BMadeira, MSalituro, GPowell, JXu, LTerebetski, JLLeone, JFMiller, PCook, JHolahan, MJoshi, AO'Malley, SPurcell, MPosavec, DChen, TBRiffel, KWilliams, MHargreaves, RSullivan, KANargund, RPDeVita, RJ Discovery of MK-3168: A PET Tracer for Imaging Brain Fatty Acid Amide Hydrolase. ACS Med Chem Lett4:509-13 (2013) 
 
Fatty-acid amide hydrolase 1
Name:Fatty-acid amide hydrolase 1
Type:Protein
Mol. Mass.:63071.19
Organism:Homo sapiens (Human)
Description:O00519
Residue:579
BDBM50434318
NameBDBM50434318
Synonyms:CHEMBL2386566
TypeSmall organic molecule
Emp. Form.C22H22ClN3OS
Mol. Mass.411.948
SMILESCN(C)C(=O)[C@H]1C[C@@H]1c1ccc(cc1)-c1ncn(C)c1Sc1ccc(Cl)cc1