Reaction Details
TargetSerine/threonine-protein kinase PAK 3
LigandBDBM50434330
Substrate/Competitorn/a
Meas. Tech.ChEMBL_960987 (CHEMBL2388903)
IC50 64±n/a nM
Citation Abdel-Magid, AF PAK1: A Therapeutic Target for Cancer Treatment. ACS Med Chem Lett4:431-2 (2013) 
 
Serine/threonine-protein kinase PAK 3
Name:Serine/threonine-protein kinase PAK 3
Type:Enzyme
Mol. Mass.:62298.33
Organism:Homo sapiens (Human)
Description:O75914
Residue:559
BDBM50434330
NameBDBM50434330
Synonyms:CHEMBL2386715
TypeSmall organic molecule
Emp. Form.C21H23FN8O
Mol. Mass.422.4587
SMILESCOCCN(Cc1cc(F)cc2[nH]ncc12)c1nccc(Nc2cc(n[nH]2)C2CC2)n1