Reaction Details
TargetSerine/threonine-protein kinase PAK 3
LigandBDBM50434332
Substrate/Competitorn/a
Meas. Tech.ChEMBL_960987 (CHEMBL2388903)
IC50 133±n/a nM
Citation Abdel-Magid, AF PAK1: A Therapeutic Target for Cancer Treatment. ACS Med Chem Lett4:431-2 (2013) 
 
Serine/threonine-protein kinase PAK 3
Name:Serine/threonine-protein kinase PAK 3
Type:Enzyme
Mol. Mass.:62298.33
Organism:Homo sapiens (Human)
Description:O75914
Residue:559
BDBM50434332
NameBDBM50434332
Synonyms:CHEMBL2386716
TypeSmall organic molecule
Emp. Form.C21H23N7
Mol. Mass.373.4542
SMILESC[C@H](Nc1nccc(Nc2cc(n[nH]2)C2CCC2)n1)c1ccc2[nH]ccc2c1