Reaction Details
TargetHistamine H3 receptor
LigandBDBM50434334
Substrate/Competitorn/a
Meas. Tech.ChEMBL_961000 (CHEMBL2388916)
Ki 0.32±n/a nM
Citation Rosse, G Novel thiazolobenzodiazepines as inhibitors of histamine h3 receptor. ACS Med Chem Lett4:435-435 (2013) 
 
Histamine H3 receptor
Name:Histamine H3 receptor
Type:G Protein-Coupled Receptor (GPCR)
Mol. Mass.:48607.98
Organism:Rattus norvegicus (rat)
Description:n/a
Residue:445
BDBM50434334
NameBDBM50434334
Synonyms:CHEMBL2386730 | US9181275, 4
TypeSmall organic molecule
Emp. Form.C25H29N3O2S
Mol. Mass.435.582
SMILESCC1=C(SC2=NCc3ccccc3CN12)c1ccc(OCCCN2CCOCC2)cc1