Reaction Details
TargetDual specificity tyrosine-phosphorylation-regulated kinase 1A
LigandBDBM50434357
Substrate/Competitorn/a
Meas. Tech.ChEMBL_961005 (CHEMBL2388921)
IC50 9.5±n/a nM
Citation Rosse, G Tricyclic Pyrimidines As Inhibitors of DYRK1A/DYRK1B As Potential Treatment for Down's Syndrome or Alzheimer's Disease. ACS Med Chem Lett4:502-3 (2013) 
 
Dual specificity tyrosine-phosphorylation-regulated kinase 1A
Name:Dual specificity tyrosine-phosphorylation-regulated kinase 1A
Type:Enzyme
Mol. Mass.:85616.61
Organism:Homo sapiens (Human)
Description:Q13627
Residue:763
BDBM50434357
NameBDBM50434357
Synonyms:CHEMBL2386743 | US9446044, 62
TypeSmall organic molecule
Emp. Form.C19H17N5O3S
Mol. Mass.395.435
SMILESCOC(=N)c1nc2ccc3ncnc(Nc4ccc(OC)cc4OC)c3c2s1