Reaction Details
TargetDual specificity tyrosine-phosphorylation-regulated kinase 1B
LigandBDBM50434361
Substrate/Competitorn/a
Meas. Tech.ChEMBL_961004 (CHEMBL2388920)
IC50 94±n/a nM
Citation Rosse, G Tricyclic Pyrimidines As Inhibitors of DYRK1A/DYRK1B As Potential Treatment for Down's Syndrome or Alzheimer's Disease. ACS Med Chem Lett4:502-3 (2013) 
 
Dual specificity tyrosine-phosphorylation-regulated kinase 1B
Name:Dual specificity tyrosine-phosphorylation-regulated kinase 1B
Type:Enzyme
Mol. Mass.:69222.24
Organism:Homo sapiens (Human)
Description:Q9Y463
Residue:629
BDBM50434361
NameBDBM50434361
Synonyms:CHEMBL2386767 | US9446044, 74
TypeSmall organic molecule
Emp. Form.C21H21N5OS
Mol. Mass.391.489
SMILESCOC(=N)c1nc2ccc3ncnc(Nc4ccc(cc4)C(C)(C)C)c3c2s1