Reaction Details
TargetMicrotubule-associated protein tau
LigandBDBM32299
Substrate/Competitorn/a
Meas. Tech.ChEMBL_961342 (CHEMBL2390669)
IC50 380±n/a nM
Citation Bulic, BPickhardt, MMandelkow, E Progress and developments in tau aggregation inhibitors for Alzheimer disease. J Med Chem56:4135-55 (2013) 
 
Microtubule-associated protein tau
Name:Microtubule-associated protein tau
Type:Protein
Mol. Mass.:78928.63
Organism:Homo sapiens (Human)
Description:P10636
Residue:758
BDBM32299
NameBDBM32299
Synonyms:2-[(2Z)-2-[(2E)-2-[[3-(2-hydroxyethyl)-5-methoxy-1,3-benzothiazol-3-ium-2-yl]methylidene]butylidene]-5-methoxy-1,3-benzothiazol-3-yl]ethanol;chloride 3-(2-Hydroxy-ethyl)-2-{2-[3-(2-hydroxy-ethyl)-5-methoxy-3H-benzothiazol-2-ylidenemethyl]-but-1-enyl}-5-methoxy-benzothiazol-3-ium Cyanines, 2 SMR000175124 | cid_12004742
TypeSmall organic molecule
Emp. Form.C25H29N2O4S2
Mol. Mass.485.638
SMILESCC\C(=C/c1sc2ccc(OC)cc2[n+]1CCO)\C=C1/Sc2ccc(OC)cc2N1CCO