Reaction Details
TargetMicrotubule-associated protein tau
LigandBDBM50434371
Substrate/Competitorn/a
Meas. Tech.ChEMBL_961354 (CHEMBL2390681)
IC50 69±n/a nM
Citation Bulic, BPickhardt, MMandelkow, E Progress and developments in tau aggregation inhibitors for Alzheimer disease. J Med Chem56:4135-55 (2013) 
 
Microtubule-associated protein tau
Name:Microtubule-associated protein tau
Type:Protein
Mol. Mass.:78928.63
Organism:Homo sapiens (Human)
Description:P10636
Residue:758
BDBM50434371
NameBDBM50434371
Synonyms:AZURE A | Azure A (12)
TypeSmall organic molecule
Emp. Form.C14H14N3S
Mol. Mass.256.346
SMILESC[N+](C)=c1ccc2nc3ccc(N)cc3sc2c1