Reaction Details
TargetRenin
LigandBDBM50434442
Substrate/Competitorn/a
Meas. Tech.ChEMBL_962066 (CHEMBL2388034)
IC50 1.6±n/a nM
Citation Nakamura, YFujimoto, TOgawa, YNamiki, HSuzuki, SAsano, MSugita, CMochizuki, AMiyazaki, STamaki, KNagai, YInoue, SNagayama, TKato, MChiba, KTakasuna, KNishi, T Lead optimization of 5-amino-6-(2,2-dimethyl-5-oxo-4-phenylpiperazin-1-yl)-4-hydroxyhexanamides to reduce a cardiac safety issue: discovery of DS-8108b, an orally active renin inhibitor. Bioorg Med Chem21:3175-96 (2013) 
 
Renin
Name:Renin
Type:Enzyme
Mol. Mass.:45058.99
Organism:Homo sapiens (Human)
Description:n/a
Residue:406
BDBM50434442
NameBDBM50434442
Synonyms:CHEMBL2387550
TypeSmall organic molecule
Emp. Form.C26H36ClN5O3
Mol. Mass.502.049
SMILESCC(C)[C@H](C[C@H](O)[C@@H](N)CN1CC(=O)N(CC1(C)C)c1ccccc1Cl)C(=O)Nc1ccncc1