Reaction Details
TargetRenin
LigandBDBM50434421
Substrate/Competitorn/a
Meas. Tech.ChEMBL_962065 (CHEMBL2388033)
IC50 1.2±n/a nM
Citation Nakamura, YFujimoto, TOgawa, YNamiki, HSuzuki, SAsano, MSugita, CMochizuki, AMiyazaki, STamaki, KNagai, YInoue, SNagayama, TKato, MChiba, KTakasuna, KNishi, T Lead optimization of 5-amino-6-(2,2-dimethyl-5-oxo-4-phenylpiperazin-1-yl)-4-hydroxyhexanamides to reduce a cardiac safety issue: discovery of DS-8108b, an orally active renin inhibitor. Bioorg Med Chem21:3175-96 (2013) 
 
Renin
Name:Renin
Type:PROTEIN
Mol. Mass.:45012.96
Organism:Macaca fascicularis
Description:ChEMBL_979177
Residue:406
BDBM50434421
NameBDBM50434421
Synonyms:CHEMBL2387571
TypeSmall organic molecule
Emp. Form.C31H46ClN5O4
Mol. Mass.588.181
SMILESCC[C@H](C[C@H](O)[C@@H](N)CN1CC(=O)N(CC1(C)C)c1ccccc1Cl)C(=O)NC1C2CC3CC1CC(C3)(C2)C(N)=O