Reaction Details
TargetInsulin-like growth factor 1 receptor
LigandBDBM50434485
Substrate/Competitorn/a
Meas. Tech.ChEMBL_961504 (CHEMBL2388362)
IC50>30000±n/a nM
Citation Xiao, DPalani, AHuang, XSofolarides, MZhou, WChen, XAslanian, RGuo, ZFossetta, JTian, FTrivedi, PSpacciapoli, PWhitehurst, CELundell, D Conformation constraint of anilides enabling the discovery of tricyclic lactams as potent MK2 non-ATP competitive inhibitors. Bioorg Med Chem Lett23:3262-6 (2013) 
 
Insulin-like growth factor 1 receptor
Name:Insulin-like growth factor 1 receptor
Type:Protein
Mol. Mass.:154776.79
Organism:Homo sapiens (Human)
Description:P08069
Residue:1367
BDBM50434485
NameBDBM50434485
Synonyms:CHEMBL2385543
TypeSmall organic molecule
Emp. Form.C34H29ClN4O2
Mol. Mass.561.073
SMILESClc1ccc(cc1)-c1cc2Cc3cc(ccc3N(Cc3ccccc3-c3cccnc3)C(=O)c2o1)N1CCNCC1